{"text_format":"1","workbook":"xlsx","n_sheets":7,"sheets":["Capa","0-Inic","0-Proj","1-Inic","1-Proj","Extintores","Tabelas"],"not_rendered":{"charts":4,"images":2,"macros":1,"external_links":0,"defined_names":7,"comments":0,"pivot_tables":0},"unopened":[],"bounds":{"document_bytes":16777216,"sheet_cells":100000,"rows_first":2000,"rows_last":500,"rows_between":2000,"halvings":0,"cell_chars":16384,"cell_head_chars":4096},"cells_cut":0,"cells_raw":0,"read":"whole","date_system":"1900"}

{"sheet":"Capa","index":0,"n_rows":50,"n_cols":16,"rows_kept":50,"cut":false,"hidden":false,"merged":[[10,5,10,6],[12,4,12,5],[13,5,13,6],[27,7,27,8],[17,4,17,5],[15,6,15,8],[26,7,26,8],[22,7,22,8],[19,5,19,8],[24,5,24,8],[20,7,20,8],[25,7,25,8],[5,4,5,7],[6,5,6,6],[7,5,7,6],[8,5,8,6],[9,5,9,6],[37,5,37,6],[38,5,38,6],[36,4,36,5],[29,7,29,8],[29,5,29,6],[30,4,30,8],[31,4,31,8],[33,4,33,5],[34,4,34,8]]}
[]
[]
[null,null,null,null,{"$f":"Tabelas!B4","v":"ARICA:2019"},null,null,null,null,null,null,{"$f":"Tabelas!B71","v":"Condições iniciais"},1,null,null,{"$f":"Tabelas!B6","v":"Comentários (não não visíveis no relatório)"}]
[null,null,null,null,{"$f":"Tabelas!$B$5","v":"MÉTODO DE AVALIAÇÃO DA SEGURANÇA AO INCÊNDIO EM EDIFÍCIOS EXISTENTES"},null,null,null,"Folha de cálculo versão 1.2",null,null,{"$f":"Tabelas!B73","v":"Condições de projeto"},1]
[]
[null,null,"A.",null,{"$f":"Tabelas!B24","v":"Identificação"}]
[null,null,null,null,{"$f":"Tabelas!B26","v":"Dono de obra"}]
[null,null,null,null,{"$f":"Tabelas!B27","v":"Rua/Av."},null,null,{"$f":"Tabelas!B31","v":"Andar"}]
[null,null,null,null,{"$f":"Tabelas!B28","v":"Localidade"},null,null,{"$f":"Tabelas!B30","v":"N.º/Lote"}]
[null,null,null,null,{"$f":"Tabelas!B32","v":"Freguesia"}]
[null,null,null,null,{"$f":"Tabelas!B29","v":"Código postal"}]
[]
[null,null,{"$f":"Tabelas!A34","v":"B."},null,{"$f":"Tabelas!B34","v":"Caraterísticas da intervenção"}]
[null,null,null,null,{"$f":"Tabelas!B39","v":"Extensão da intervenção"},null,null,{"$f":"Tabelas!B36","v":"Altura do edifício"}]
[]
[null,null,null,null,{"$f":"Tabelas!B43","v":"Tipo de intervenção"},null,{"$f":"IF(F16=Tabelas!C44, Tabelas!B44,IF(F16=Tabelas!C45,Tabelas!B45,IF(F16=Tabelas!C46,Tabelas!B46,IF(F16=Tabelas!C47,Tabelas!B47,\"\"))))","v":""}]
[]
[null,null,"C.",null,{"$f":"Tabelas!B49","v":"Resultados"}]
[]
[null,null,null,null,{"$f":"Tabelas!B71","v":"Condições iniciais"}]
[null,null,null,null,null,"Unidade de análise 1",null,{"$f":"'1-Inic'!G43","v":0}]
[]
[null,null,null,null,null,{"$f":"Tabelas!B54","v":"Índice de segurança ao incêndio "},null,{"$f":"MIN(H20:I22)","v":0}]
[]
[null,null,null,null,{"$f":"Tabelas!B73","v":"Condições de projeto"}]
[null,null,null,null,null,"Unidade de análise 1",null,{"$f":"'1-Proj'!G43","v":0}]
[]
[null,null,null,null,null,{"$f":"Tabelas!B54","v":"Índice de segurança ao incêndio "},null,{"$f":"MIN(H25:I27)","v":0}]
[]
[null,null,null,null,null,{"$f":"Tabelas!B55&\" (\"&IF(F$16=Tabelas!C$44,F44,IF(F$16=Tabelas!C$45,F46,IF(F$16=Tabelas!C$46,F48,IF(F$16=Tabelas!C$47,F50,\"\"))))&\")\"","v":"Desempenho global mínimo ()"},null,{"$f":"IF(F$16=Tabelas!C$44,E44,IF(F$16=Tabelas!C$45,E46,IF(F$16=Tabelas!C$46,E48,IF(F$16=Tabelas!C$47,E50,\"\"))))","v":""}]
[]
[null,null,null,null,{"$f":"IF(F$16=Tabelas!C$47,Tabelas!B21,\"\")","v":""}]
[]
[null,null,{"$f":"Tabelas!A57","v":"D."},null,{"$f":"Tabelas!B57","v":"Observações"}]
[]
[]
[null,null,{"$f":"Tabelas!A59","v":"E."},null,{"$f":"Tabelas!B59","v":"Técnico"}]
[null,null,null,null,{"$f":"Tabelas!B60","v":"Projetista"},null,null,{"$f":"Tabelas!B64","v":"Data"}]
[null,null,null,null,{"$f":"Tabelas!B61","v":"Ordem"},null,null,{"$f":"Tabelas!B63","v":"n.º"}]
[]
{"$rows_left_out":11}
{"sheet":"0-Inic","index":1,"n_rows":189,"n_cols":15,"rows_kept":189,"cut":false,"hidden":true,"merged":[[2,6,3,6],[64,6,65,6],[101,6,102,6],[155,6,156,6]]}
[]
[]
[null,null,null,null,{"$f":"Tabelas!$B$4","v":"ARICA:2019"},null,"0"]
[null,null,null,null,{"$f":"Tabelas!$B$70","v":"CONDIÇÕES INICIAIS"},null,null,null,null,null,null,null,null,null,{"$f":"Tabelas!$B$6","v":"Comentários (não não visíveis no relatório)"}]
[]
[null,null,null,null,{"$f":"Tabelas!B75","v":"Carateristicas da unidade"}]
[null,null,null,null,{"$f":"Tabelas!$B$77","v":"Tipo de local de risco"}]
[null,null,null,null,{"$f":"Tabelas!$B$91","v":"Utilização tipo"}]
[null,null,null,null,{"$f":"Tabelas!B85","v":"Categoria de risco"}]
[]
[null,null,null,null,{"$f":"Tabelas!B105","v":"Resumo"}]
[null,null,{"$f":"Tabelas!A109","v":"1."},null,{"$f":"Tabelas!B109","v":"Início do incêndio"},null,{"$f":"G68","v":""}]
[null,null,null,null,{"$f":"IF(OR(G13=\"\",G13=\"-\"),\"-\",F13)","v":"-"},{"$f":"Tabelas!$B$111","v":"Anomalias que podem provocar um incêndio"},{"$f":"G69","v":""}]
[null,null,null,null,{"$f":"IF(OR(G14=\"\",G14=\"-\"),\"-\",F14)","v":"-"},{"$f":"Tabelas!$B$117","v":"Instalações técnicas"},{"$f":"G70","v":""}]
[]
[null,null,{"$f":"Tabelas!A154","v":"2."},null,{"$f":"Tabelas!B154","v":"Desenvolvimento e propagação do incêndio"},null,{"$f":"G79","v":""}]
[null,null,null,null,{"$f":"IF(OR(G17=\"\",G17=\"-\"),\"-\",F17)","v":"-"},{"$f":"Tabelas!$B$156","v":"Materiais de revestimento do local de risco"},{"$f":"G80","v":""}]
[null,null,null,null,{"$f":"IF(OR(G18=\"\",G18=\"-\"),\"-\",F18)","v":"-"},{"$f":"Tabelas!$B177","v":"Materiais de revestimento das vias de evacuação"},{"$f":"G83","v":""}]
[null,null,null,null,{"$f":"IF(OR(G19=\"\",G19=\"-\"),\"-\",F19)","v":"-"},{"$f":"Tabelas!$B$198","v":"Isolamento e proteção do local de risco"},{"$f":"G86","v":""}]
[null,null,null,null,"-",{"$f":"Tabelas!$B$221","v":"Compartimentação geral corta-fogo da área de intervenção"},{"$f":"G89","v":""}]
[null,null,null,null,"-",{"$f":"Tabelas!B226","v":"Isolamento e proteção entre utilizações-tipo distintas"},{"$f":"G90","v":""}]
[null,null,null,null,"-",{"$f":"Tabelas!$B$236","v":"Equipas de segurança"},{"$f":"G91","v":""}]
[null,null,null,null,"-",{"$f":"Tabelas!$B$249","v":"Deteção, alerta e alarme de incêndio"},{"$f":"G92","v":""}]
[null,null,null,null,"-",{"$f":"Tabelas!$B$266","v":"Propagação pelo exterior"},{"$f":"G95","v":""}]
[]
[null,null,{"$f":"Tabelas!A294","v":"3."},null,{"$f":"Tabelas!B294","v":"Evacuação em caso de incêndio"},null,{"$f":"G105","v":""}]
[null,null,null,null,{"$f":"IF(OR(G27=\"\",G27=\"-\"),\"-\",F27)","v":"-"},{"$f":"Tabelas!$B$301","v":"Saídas do local de risco"},{"$f":"G107","v":""}]
[null,null,null,null,{"$f":"IF(OR(G28=\"\",G28=\"-\"),\"-\",F28)","v":"-"},{"$f":"Tabelas!$B$330","v":"Dimensões dos locais e das vias horizontais de evacuação"},{"$f":"G114","v":""}]
[null,null,null,null,{"$f":"IF(OR(G29=\"\",G29=\"-\"),\"-\",F29)","v":"-"},{"$f":"Tabelas!$B$407","v":"Dimensões das vias verticais de evacuação"},{"$f":"G142","v":""}]
[null,null,null,null,"-",{"$f":"Tabelas!$B$432","v":"Isolamento e proteção das vias de evacuação"},{"$f":"G159","v":""}]
[null,null,null,null,"-",{"$f":"Tabelas!$B$445","v":"Controlo de fumo na unidade de análise"},{"$f":"G162","v":""}]
[null,null,null,null,"-",{"$f":"Tabelas!$B$463","v":"Sinalização de emergência na unidade de análise"},{"$f":"G165","v":""}]
[null,null,null,null,"-",{"$f":"Tabelas!$B$483","v":"Iluminação de emergência na unidade de análise"},{"$f":"G168","v":""}]
[null,null,null,null,"-",{"$f":"Tabelas!$B$503","v":"Equipas de segurança"},{"$f":"G171","v":""}]
[null,null,null,null,"-",{"$f":"Tabelas!$B$505","v":"Deteção, alerta e alarme de incêndio"},{"$f":"G172","v":""}]
[null,null,null,null,"-",{"$f":"Tabelas!$B$513","v":"Simulacros de evacuação "},{"$f":"G173","v":""}]
[]
[null,null,{"$f":"Tabelas!A521","v":"4."},null,{"$f":"Tabelas!B521","v":"Combate ao incêndio"},null,{"$f":"G175","v":""}]
[null,null,null,null,{"$f":"IF(OR(G39=\"\",G39=\"-\"),\"-\",F39)","v":"-"},{"$f":"Tabelas!$B$522","v":"Acessibilidade e meios de intervenção não automáticos"},{"$f":"G176","v":""}]
[null,null,null,null,{"$f":"IF(OR(G40=\"\",G40=\"-\"),\"-\",F40)","v":"-"},{"$f":"Tabelas!$B$566","v":"Meios de extinção automáticos"},{"$f":"G188","v":""}]
{"$rows_left_out":150}
{"sheet":"0-Proj","index":2,"n_rows":240,"n_cols":15,"rows_kept":240,"cut":false,"hidden":true,"merged":[[199,4,199,6],[2,6,3,6],[64,6,65,6],[101,6,102,6],[155,6,156,6],[191,6,192,6],[215,4,215,6],[200,4,200,6],[203,4,203,6],[204,4,204,6],[207,4,207,6],[208,4,208,6],[211,4,211,6],[212,4,212,6],[231,4,231,6],[216,4,216,6],[219,4,219,6],[220,4,220,6],[223,4,223,6],[224,4,224,6],[227,4,227,6],[228,4,228,6],[240,4,240,6],[232,4,232,6],[235,4,235,6],[236,4,236,6],[239,4,239,6]]}
[]
[]
[null,null,null,null,{"$f":"Tabelas!$B$4","v":"ARICA:2019"},null,"0"]
[null,null,null,null,{"$f":"Tabelas!$B$72","v":"CONDIÇÕES DE PROJETO"},null,null,null,null,null,null,null,null,null,{"$f":"Tabelas!$B$6","v":"Comentários (não não visíveis no relatório)"}]
[]
[null,null,null,null,{"$f":"Tabelas!B75","v":"Carateristicas da unidade"}]
[null,null,null,null,{"$f":"Tabelas!$B$77","v":"Tipo de local de risco"}]
[null,null,null,null,{"$f":"Tabelas!$B$91","v":"Utilização tipo"}]
[null,null,null,null,{"$f":"Tabelas!B85","v":"Categoria de risco"}]
[]
[null,null,null,null,{"$f":"Tabelas!B105","v":"Resumo"}]
[null,null,{"$f":"Tabelas!A109","v":"1."},null,{"$f":"Tabelas!B109","v":"Início do incêndio"},null,{"$f":"G68","v":""}]
[null,null,null,null,{"$f":"IF(OR(G13=\"\",G13=\"-\"),\"-\",F13)","v":"-"},{"$f":"Tabelas!$B$111","v":"Anomalias que podem provocar um incêndio"},{"$f":"G69","v":""}]
[null,null,null,null,{"$f":"IF(OR(G14=\"\",G14=\"-\"),\"-\",F14)","v":"-"},{"$f":"Tabelas!$B$117","v":"Instalações técnicas"},{"$f":"G70","v":""}]
[]
[null,null,{"$f":"Tabelas!A154","v":"2."},null,{"$f":"Tabelas!B154","v":"Desenvolvimento e propagação do incêndio"},null,{"$f":"G79","v":""}]
[null,null,null,null,{"$f":"IF(OR(G17=\"\",G17=\"-\"),\"-\",F17)","v":"-"},{"$f":"Tabelas!$B$156","v":"Materiais de revestimento do local de risco"},{"$f":"G80","v":""}]
[null,null,null,null,{"$f":"IF(OR(G18=\"\",G18=\"-\"),\"-\",F18)","v":"-"},{"$f":"Tabelas!$B177","v":"Materiais de revestimento das vias de evacuação"},{"$f":"G83","v":""}]
[null,null,null,null,{"$f":"IF(OR(G19=\"\",G19=\"-\"),\"-\",F19)","v":"-"},{"$f":"Tabelas!$B$198","v":"Isolamento e proteção do local de risco"},{"$f":"G86","v":""}]
[null,null,null,null,"-",{"$f":"Tabelas!$B$221","v":"Compartimentação geral corta-fogo da área de intervenção"},{"$f":"G89","v":""}]
[null,null,null,null,"-",{"$f":"Tabelas!B226","v":"Isolamento e proteção entre utilizações-tipo distintas"},{"$f":"G90","v":""}]
[null,null,null,null,"-",{"$f":"Tabelas!$B$236","v":"Equipas de segurança"},{"$f":"G91","v":""}]
[null,null,null,null,"-",{"$f":"Tabelas!$B$249","v":"Deteção, alerta e alarme de incêndio"},{"$f":"G92","v":""}]
[null,null,null,null,"-",{"$f":"Tabelas!$B$266","v":"Propagação pelo exterior"},{"$f":"G95","v":""}]
[]
[null,null,{"$f":"Tabelas!A294","v":"3."},null,{"$f":"Tabelas!B294","v":"Evacuação em caso de incêndio"},null,{"$f":"G105","v":""}]
[null,null,null,null,{"$f":"IF(OR(G27=\"\",G27=\"-\"),\"-\",F27)","v":"-"},{"$f":"Tabelas!$B$301","v":"Saídas do local de risco"},{"$f":"G106","v":""}]
[null,null,null,null,{"$f":"IF(OR(G28=\"\",G28=\"-\"),\"-\",F28)","v":"-"},{"$f":"Tabelas!$B$330","v":"Dimensões dos locais e das vias horizontais de evacuação"},{"$f":"G114","v":""}]
[null,null,null,null,{"$f":"IF(OR(G29=\"\",G29=\"-\"),\"-\",F29)","v":"-"},{"$f":"Tabelas!$B$407","v":"Dimensões das vias verticais de evacuação"},{"$f":"G142","v":""}]
[null,null,null,null,"-",{"$f":"Tabelas!$B$432","v":"Isolamento e proteção das vias de evacuação"},{"$f":"G159","v":""}]
[null,null,null,null,"-",{"$f":"Tabelas!$B$445","v":"Controlo de fumo na unidade de análise"},{"$f":"G162","v":""}]
[null,null,null,null,"-",{"$f":"Tabelas!$B$463","v":"Sinalização de emergência na unidade de análise"},{"$f":"G165","v":""}]
[null,null,null,null,"-",{"$f":"Tabelas!$B$483","v":"Iluminação de emergência na unidade de análise"},{"$f":"G168","v":""}]
[null,null,null,null,"-",{"$f":"Tabelas!$B$503","v":"Equipas de segurança"},{"$f":"G171","v":""}]
[null,null,null,null,"-",{"$f":"Tabelas!$B$505","v":"Deteção, alerta e alarme de incêndio"},{"$f":"G172","v":""}]
[null,null,null,null,"-",{"$f":"Tabelas!$B$513","v":"Simulacros de evacuação "},{"$f":"G173","v":""}]
[]
[null,null,{"$f":"Tabelas!A521","v":"4."},null,{"$f":"Tabelas!B521","v":"Combate ao incêndio"},null,{"$f":"G175","v":""}]
[null,null,null,null,{"$f":"IF(OR(G39=\"\",G39=\"-\"),\"-\",F39)","v":"-"},{"$f":"Tabelas!$B$522","v":"Acessibilidade e meios de intervenção não automáticos"},{"$f":"G176","v":""}]
[null,null,null,null,{"$f":"IF(OR(G40=\"\",G40=\"-\"),\"-\",F40)","v":"-"},{"$f":"Tabelas!$B$566","v":"Meios de extinção automáticos"},{"$f":"G188","v":""}]
{"$rows_left_out":201}
{"sheet":"1-Inic","index":3,"n_rows":189,"n_cols":15,"rows_kept":189,"cut":false,"hidden":false,"merged":[[2,6,3,6],[64,6,65,6],[101,6,102,6],[155,6,156,6]]}
[]
[]
[null,null,null,null,{"$f":"Tabelas!$B$4","v":"ARICA:2019"},{"$f":"Tabelas!B69&\" - \"&Capa!G21","v":"Unidade de análise - "},1]
[null,null,null,null,{"$f":"Tabelas!$B$70","v":"CONDIÇÕES INICIAIS"},null,null,null,null,null,null,null,null,null,{"$f":"Tabelas!$B$6","v":"Comentários (não não visíveis no relatório)"}]
[]
[null,null,null,null,{"$f":"Tabelas!B75","v":"Carateristicas da unidade"}]
[null,null,null,null,{"$f":"Tabelas!$B$77","v":"Tipo de local de risco"}]
[null,null,null,null,{"$f":"Tabelas!$B$91","v":"Utilização tipo"}]
[null,null,null,null,{"$f":"Tabelas!B85","v":"Categoria de risco"}]
[]
[null,null,null,null,{"$f":"Tabelas!B105","v":"Resumo"}]
[null,null,{"$f":"Tabelas!A109","v":"1."},null,{"$f":"Tabelas!B109","v":"Início do incêndio"},null,{"$f":"G68","v":""}]
[null,null,null,null,{"$f":"IF(OR(G13=\"\",G13=\"-\"),\"-\",F13)","v":"-"},{"$f":"Tabelas!$B$111","v":"Anomalias que podem provocar um incêndio"},{"$f":"G69","v":""}]
[null,null,null,null,{"$f":"IF(OR(G14=\"\",G14=\"-\"),\"-\",F14)","v":"-"},{"$f":"Tabelas!$B$117","v":"Instalações técnicas"},{"$f":"G70","v":""}]
[]
[null,null,{"$f":"Tabelas!A154","v":"2."},null,{"$f":"Tabelas!B154","v":"Desenvolvimento e propagação do incêndio"},null,{"$f":"G79","v":""}]
[null,null,null,null,{"$f":"IF(OR(G17=\"\",G17=\"-\"),\"-\",F17)","v":"-"},{"$f":"Tabelas!$B$156","v":"Materiais de revestimento do local de risco"},{"$f":"G80","v":""}]
[null,null,null,null,{"$f":"IF(OR(G18=\"\",G18=\"-\"),\"-\",F18)","v":"-"},{"$f":"Tabelas!$B177","v":"Materiais de revestimento das vias de evacuação"},{"$f":"G83","v":""}]
[null,null,null,null,{"$f":"IF(OR(G19=\"\",G19=\"-\"),\"-\",F19)","v":"-"},{"$f":"Tabelas!$B$198","v":"Isolamento e proteção do local de risco"},{"$f":"G86","v":""}]
[null,null,null,null,"-",{"$f":"Tabelas!$B$221","v":"Compartimentação geral corta-fogo da área de intervenção"},{"$f":"G89","v":""}]
[null,null,null,null,"-",{"$f":"Tabelas!B226","v":"Isolamento e proteção entre utilizações-tipo distintas"},{"$f":"G90","v":""}]
[null,null,null,null,"-",{"$f":"Tabelas!$B$236","v":"Equipas de segurança"},{"$f":"G91","v":""}]
[null,null,null,null,"-",{"$f":"Tabelas!$B$249","v":"Deteção, alerta e alarme de incêndio"},{"$f":"G92","v":""}]
[null,null,null,null,"-",{"$f":"Tabelas!$B$266","v":"Propagação pelo exterior"},{"$f":"G95","v":""}]
[]
[null,null,{"$f":"Tabelas!A294","v":"3."},null,{"$f":"Tabelas!B294","v":"Evacuação em caso de incêndio"},null,{"$f":"G105","v":""}]
[null,null,null,null,{"$f":"IF(OR(G27=\"\",G27=\"-\"),\"-\",F27)","v":"-"},{"$f":"Tabelas!$B$301","v":"Saídas do local de risco"},{"$f":"G107","v":""}]
[null,null,null,null,{"$f":"IF(OR(G28=\"\",G28=\"-\"),\"-\",F28)","v":"-"},{"$f":"Tabelas!$B$330","v":"Dimensões dos locais e das vias horizontais de evacuação"},{"$f":"G114","v":""}]
[null,null,null,null,{"$f":"IF(OR(G29=\"\",G29=\"-\"),\"-\",F29)","v":"-"},{"$f":"Tabelas!$B$407","v":"Dimensões das vias verticais de evacuação"},{"$f":"G142","v":""}]
[null,null,null,null,"-",{"$f":"Tabelas!$B$432","v":"Isolamento e proteção das vias de evacuação"},{"$f":"G159","v":""}]
[null,null,null,null,"-",{"$f":"Tabelas!$B$445","v":"Controlo de fumo na unidade de análise"},{"$f":"G162","v":""}]
[null,null,null,null,"-",{"$f":"Tabelas!$B$463","v":"Sinalização de emergência na unidade de análise"},{"$f":"G165","v":""}]
[null,null,null,null,"-",{"$f":"Tabelas!$B$483","v":"Iluminação de emergência na unidade de análise"},{"$f":"G168","v":""}]
[null,null,null,null,"-",{"$f":"Tabelas!$B$503","v":"Equipas de segurança"},{"$f":"G171","v":""}]
[null,null,null,null,"-",{"$f":"Tabelas!$B$505","v":"Deteção, alerta e alarme de incêndio"},{"$f":"G172","v":""}]
[null,null,null,null,"-",{"$f":"Tabelas!$B$513","v":"Simulacros de evacuação "},{"$f":"G173","v":""}]
[]
[null,null,{"$f":"Tabelas!A521","v":"4."},null,{"$f":"Tabelas!B521","v":"Combate ao incêndio"},null,{"$f":"G175","v":""}]
[null,null,null,null,{"$f":"IF(OR(G39=\"\",G39=\"-\"),\"-\",F39)","v":"-"},{"$f":"Tabelas!$B$522","v":"Acessibilidade e meios de intervenção não automáticos"},{"$f":"G176","v":""}]
[null,null,null,null,{"$f":"IF(OR(G40=\"\",G40=\"-\"),\"-\",F40)","v":"-"},{"$f":"Tabelas!$B$566","v":"Meios de extinção automáticos"},{"$f":"G188","v":""}]
{"$rows_left_out":150}
{"sheet":"1-Proj","index":4,"n_rows":240,"n_cols":15,"rows_kept":240,"cut":false,"hidden":false,"merged":[[199,4,199,6],[2,6,3,6],[64,6,65,6],[101,6,102,6],[155,6,156,6],[191,6,192,6],[223,4,223,6],[200,4,200,6],[203,4,203,6],[204,4,204,6],[207,4,207,6],[208,4,208,6],[211,4,211,6],[212,4,212,6],[215,4,215,6],[216,4,216,6],[219,4,219,6],[220,4,220,6],[236,4,236,6],[239,4,239,6],[240,4,240,6],[224,4,224,6],[227,4,227,6],[228,4,228,6],[231,4,231,6],[232,4,232,6],[235,4,235,6]]}
[]
[]
[null,null,null,null,{"$f":"Tabelas!$B$4","v":"ARICA:2019"},{"$f":"Tabelas!B69&\" - \"&Capa!G26","v":"Unidade de análise - "},1]
[null,null,null,null,{"$f":"Tabelas!$B$72","v":"CONDIÇÕES DE PROJETO"},null,null,null,null,null,null,null,null,null,{"$f":"Tabelas!$B$6","v":"Comentários (não não visíveis no relatório)"}]
[]
[null,null,null,null,{"$f":"Tabelas!B75","v":"Carateristicas da unidade"}]
[null,null,null,null,{"$f":"Tabelas!$B$77","v":"Tipo de local de risco"}]
[null,null,null,null,{"$f":"Tabelas!$B$91","v":"Utilização tipo"}]
[null,null,null,null,{"$f":"Tabelas!B85","v":"Categoria de risco"}]
[]
[null,null,null,null,{"$f":"Tabelas!B105","v":"Resumo"}]
[null,null,{"$f":"Tabelas!A109","v":"1."},null,{"$f":"Tabelas!B109","v":"Início do incêndio"},null,{"$f":"G68","v":""}]
[null,null,null,null,{"$f":"IF(OR(G13=\"\",G13=\"-\"),\"-\",F13)","v":"-"},{"$f":"Tabelas!$B$111","v":"Anomalias que podem provocar um incêndio"},{"$f":"G69","v":""}]
[null,null,null,null,{"$f":"IF(OR(G14=\"\",G14=\"-\"),\"-\",F14)","v":"-"},{"$f":"Tabelas!$B$117","v":"Instalações técnicas"},{"$f":"G70","v":""}]
[]
[null,null,{"$f":"Tabelas!A154","v":"2."},null,{"$f":"Tabelas!B154","v":"Desenvolvimento e propagação do incêndio"},null,{"$f":"G79","v":""}]
[null,null,null,null,{"$f":"IF(OR(G17=\"\",G17=\"-\"),\"-\",F17)","v":"-"},{"$f":"Tabelas!$B$156","v":"Materiais de revestimento do local de risco"},{"$f":"G80","v":""}]
[null,null,null,null,{"$f":"IF(OR(G18=\"\",G18=\"-\"),\"-\",F18)","v":"-"},{"$f":"Tabelas!$B177","v":"Materiais de revestimento das vias de evacuação"},{"$f":"G83","v":""}]
[null,null,null,null,{"$f":"IF(OR(G19=\"\",G19=\"-\"),\"-\",F19)","v":"-"},{"$f":"Tabelas!$B$198","v":"Isolamento e proteção do local de risco"},{"$f":"G86","v":""}]
[null,null,null,null,"-",{"$f":"Tabelas!$B$221","v":"Compartimentação geral corta-fogo da área de intervenção"},{"$f":"G89","v":""}]
[null,null,null,null,"-",{"$f":"Tabelas!B226","v":"Isolamento e proteção entre utilizações-tipo distintas"},{"$f":"G90","v":""}]
[null,null,null,null,"-",{"$f":"Tabelas!$B$236","v":"Equipas de segurança"},{"$f":"G91","v":""}]
[null,null,null,null,"-",{"$f":"Tabelas!$B$249","v":"Deteção, alerta e alarme de incêndio"},{"$f":"G92","v":""}]
[null,null,null,null,"-",{"$f":"Tabelas!$B$266","v":"Propagação pelo exterior"},{"$f":"G95","v":""}]
[]
[null,null,{"$f":"Tabelas!A294","v":"3."},null,{"$f":"Tabelas!B294","v":"Evacuação em caso de incêndio"},null,{"$f":"G105","v":""}]
[null,null,null,null,{"$f":"IF(OR(G27=\"\",G27=\"-\"),\"-\",F27)","v":"-"},{"$f":"Tabelas!$B$301","v":"Saídas do local de risco"},{"$f":"G106","v":""}]
[null,null,null,null,{"$f":"IF(OR(G28=\"\",G28=\"-\"),\"-\",F28)","v":"-"},{"$f":"Tabelas!$B$330","v":"Dimensões dos locais e das vias horizontais de evacuação"},{"$f":"G114","v":""}]
[null,null,null,null,{"$f":"IF(OR(G29=\"\",G29=\"-\"),\"-\",F29)","v":"-"},{"$f":"Tabelas!$B$407","v":"Dimensões das vias verticais de evacuação"},{"$f":"G142","v":""}]
[null,null,null,null,"-",{"$f":"Tabelas!$B$432","v":"Isolamento e proteção das vias de evacuação"},{"$f":"G159","v":""}]
[null,null,null,null,"-",{"$f":"Tabelas!$B$445","v":"Controlo de fumo na unidade de análise"},{"$f":"G162","v":""}]
[null,null,null,null,"-",{"$f":"Tabelas!$B$463","v":"Sinalização de emergência na unidade de análise"},{"$f":"G165","v":""}]
[null,null,null,null,"-",{"$f":"Tabelas!$B$483","v":"Iluminação de emergência na unidade de análise"},{"$f":"G168","v":""}]
[null,null,null,null,"-",{"$f":"Tabelas!$B$503","v":"Equipas de segurança"},{"$f":"G171","v":""}]
[null,null,null,null,"-",{"$f":"Tabelas!$B$505","v":"Deteção, alerta e alarme de incêndio"},{"$f":"G172","v":""}]
[null,null,null,null,"-",{"$f":"Tabelas!$B$513","v":"Simulacros de evacuação "},{"$f":"G173","v":""}]
[]
[null,null,{"$f":"Tabelas!A521","v":"4."},null,{"$f":"Tabelas!B521","v":"Combate ao incêndio"},null,{"$f":"G175","v":""}]
[null,null,null,null,{"$f":"IF(OR(G39=\"\",G39=\"-\"),\"-\",F39)","v":"-"},{"$f":"Tabelas!$B$522","v":"Acessibilidade e meios de intervenção não automáticos"},{"$f":"G176","v":""}]
[null,null,null,null,{"$f":"IF(OR(G40=\"\",G40=\"-\"),\"-\",F40)","v":"-"},{"$f":"Tabelas!$B$566","v":"Meios de extinção automáticos"},{"$f":"G188","v":""}]
{"$rows_left_out":201}
{"sheet":"Extintores","index":5,"n_rows":22,"n_cols":10,"rows_kept":22,"cut":false,"hidden":false,"merged":[]}
[]
[]
[null,null,null,null,"ARICA:2019"]
[null,null,null,null,{"$f":"Tabelas!B583","v":"Extintores"}]
[]
[null,null,{"$f":"Tabelas!B585","v":"N.º"},null,{"$f":"Tabelas!B586","v":"Agente extintor"},"Fator",{"$f":"Tabelas!B587","v":"Capacidade       (Kg)"},{"$f":"Tabelas!B588","v":"Capacidade (litros)"},{"$f":"Tabelas!B588","v":"Capacidade (litros)"},{"$f":"Tabelas!B587","v":"Capacidade       (Kg)"}]
[null,null,1,null,null,{"$f":"IF(E7=\"\",\"\",VLOOKUP(E7,Tabelas!B$589:C$591,2,FALSE))","v":""},null,{"$f":"IF(OR(F7=\"\",G7=\"\"),\"\",G7*F7)","v":""},null,{"$f":"IF(OR(H7=\"\",I7=\"\"),\"\",I7/F7)","v":""}]
[null,null,2,null,null,{"$f":"IF(E8=\"\",\"\",VLOOKUP(E8,Tabelas!B$589:C$591,2,FALSE))","v":""},null,"",null,{"$f":"IF(OR(H8=\"\",I8=\"\"),\"\",I8/F8)","v":""}]
[null,null,3,null,null,{"$f":"IF(E9=\"\",\"\",VLOOKUP(E9,Tabelas!B$589:C$591,2,FALSE))","v":""},null,"",null,""]
[null,null,4,null,null,{"$f":"IF(E10=\"\",\"\",VLOOKUP(E10,Tabelas!B$589:C$591,2,FALSE))","v":""},null,"",null,""]
[null,null,5,null,null,{"$f":"IF(E11=\"\",\"\",VLOOKUP(E11,Tabelas!B$589:C$591,2,FALSE))","v":""},null,"",null,""]
[null,null,6,null,null,{"$f":"IF(E12=\"\",\"\",VLOOKUP(E12,Tabelas!B$589:C$591,2,FALSE))","v":""},null,"",null,""]
[null,null,7,null,null,{"$f":"IF(E13=\"\",\"\",VLOOKUP(E13,Tabelas!B$589:C$591,2,FALSE))","v":""},null,"",null,""]
[null,null,8,null,null,{"$f":"IF(E14=\"\",\"\",VLOOKUP(E14,Tabelas!B$589:C$591,2,FALSE))","v":""},null,"",null,""]
[null,null,9,null,null,{"$f":"IF(E15=\"\",\"\",VLOOKUP(E15,Tabelas!B$589:C$591,2,FALSE))","v":""},null,"",null,""]
[null,null,10,null,null,{"$f":"IF(E16=\"\",\"\",VLOOKUP(E16,Tabelas!B$589:C$591,2,FALSE))","v":""},null,"",null,""]
[null,null,11,null,null,{"$f":"IF(E17=\"\",\"\",VLOOKUP(E17,Tabelas!B$589:C$591,2,FALSE))","v":""},null,"",null,""]
[null,null,12,null,null,{"$f":"IF(E18=\"\",\"\",VLOOKUP(E18,Tabelas!B$589:C$591,2,FALSE))","v":""},null,"",null,""]
[null,null,13,null,null,{"$f":"IF(E19=\"\",\"\",VLOOKUP(E19,Tabelas!B$589:C$591,2,FALSE))","v":""},null,"",null,""]
[null,null,14,null,null,{"$f":"IF(E20=\"\",\"\",VLOOKUP(E20,Tabelas!B$589:C$591,2,FALSE))","v":""},null,"",null,""]
[null,null,15,null,null,{"$f":"IF(E21=\"\",\"\",VLOOKUP(E21,Tabelas!B$589:C$591,2,FALSE))","v":""},null,"",null,""]
[null,null,null,null,"Total",null,{"$f":"SUM(G7:G21)","v":0},{"$f":"SUM(H7:H21)","v":0},{"$f":"SUM(I7:I21)","v":0},{"$f":"SUM(J7:J21)","v":0}]

{"sheet":"Tabelas","index":6,"n_rows":591,"n_cols":4,"rows_kept":591,"cut":false,"hidden":true,"merged":[]}
[null,"GERAL"]
[]
[null,"Cabeçalho"]
[null,"ARICA:2019"]
[null,"MÉTODO DE AVALIAÇÃO DA SEGURANÇA AO INCÊNDIO EM EDIFÍCIOS EXISTENTES"]
[null,"Comentários (não não visíveis no relatório)"]
[null,"Transversais"]
[null,"Avisos"]
[null,"Incompleto"]
[null,"Completo"]
[null," (>)"]
[null,"Sem dados"]
[null,"Valor retificado porque superior ao limite máximo"]
[null,"Valor retificado porque inferior ao limite mínimo"]
[null,"Cumpre"]
[null,"Não cumpre"]
[null,"Não aplicável"]
[null,"VERIFICA"]
[null,"NÃO VERIFICA"]
[null,"Requisitos mínimos"]
[null,"* Justificar situações de incumprimento e consensualizar propostas de mitigação com entidade licenciadora"]
[null,"ROSTO"]
[]
["A.","Identificação"]
[]
[null,"Dono de obra"]
[null,"Rua/Av."]
[null,"Localidade"]
[null,"Código postal"]
[null,"N.º/Lote"]
[null,"Andar"]
[null,"Freguesia"]
[]
["B.","Caraterísticas da intervenção"]
[]
[null,"Altura do edifício"]
[null,"Limite",28]
[]
[null,"Extensão da intervenção"]
[null,"Edifício no seu todo"]
{"$rows_left_out":551}